Op deze website gebruiken we cookies om content en advertenties te personaliseren, om functies voor social media te bieden en om ons websiteverkeer te analyseren. Ook delen we informatie over uw gebruik van onze site met onze partners voor social media, adverteren en analyse. Deze partners kunnen deze gegevens combineren met andere informatie die u aan ze heeft verstrekt of die ze hebben verzameld op basis van uw gebruik van hun services. Meer informatie.

Akkoord

Vraag & Antwoord

OS Linux

[FC-2] fout tijdens compliren met suspend to disk optie

Systeem: Asus L3800C met FC-2 zie: http://www-lehre.inf.uos.de/~rfreund/swsusp2 dit volg ik om swsup2 in de kernel te krijgen. Met xconfig netjes de optie in de kernel aangezet en make mrproper en dan compileren met make bzImage al snel een fout met: zie onder Zowel bij Fedora als andere sites bexocht, Google, etc, maar ik begrijp de boodschap niet. Tips welkom. [code:1:ced98ed6db] [root@mobail linux-2.6.5-1.358]# make bzImage make[1]: `arch/i386/kernel/asm-offsets.s' is up to date. CHK include/linux/compile.h CC arch/i386/kernel/process.o arch/i386/kernel/process.c: In function `sys_fork': arch/i386/kernel/process.c:628: error: `DECLARE_SWSUSP_LOCAL_VAR' undeclared (first use in this function) arch/i386/kernel/process.c:628: error: (Each undeclared identifier is reported only once arch/i386/kernel/process.c:628: error: for each function it appears in.) arch/i386/kernel/process.c:629: let op: implicit declaration of function `SWSUSP_ACTIVITY_START' arch/i386/kernel/process.c:631: error: `SWSUSP_ACTIVITY_END' undeclared (first use in this function) arch/i386/kernel/process.c: In function `sys_clone': arch/i386/kernel/process.c:641: error: `DECLARE_SWSUSP_LOCAL_VAR' undeclared (first use in this function) arch/i386/kernel/process.c:652: error: `SWSUSP_ACTIVITY_END' undeclared (first use in this function) arch/i386/kernel/process.c: In function `sys_vfork': arch/i386/kernel/process.c:670: error: `DECLARE_SWSUSP_LOCAL_VAR' undeclared (first use in this function) arch/i386/kernel/process.c:674: error: `SWSUSP_ACTIVITY_END' undeclared (first use in this function) make[1]: *** [arch/i386/kernel/process.o] Fout 1 make: *** [arch/i386/kernel] Fout 2 [root@mobail linux-2.6.5-1.358]#[/code:1:ced98ed6db]

andre@home