Vraag & Antwoord

OS Linux

NET::DNS Module

3 antwoorden
  • Tijdens het installeren van de perl [url=http://search.cpan.org/~olaf/Net-DNS-0.53/lib/Net/DNS.pm]NET:DNS[/url] module krijg ik de volgende foutmelding: [code:1:8532601fb8] Testing module Executing make test .. PERL_DL_NONLAZY=1 /usr/bin/perl5.8.4 "-MExtUtils::Command::MM" "-e" "test_harness(0, 'blib/lib', 'bl ib/arch')" t/*.t t/00-load..................ok t/00-pod...................ok t/00-version...............ok t/01-resolver-env..........ok t/01-resolver-file.........ok 7/8 skipped: Could not read configuration file t/01-resolver-opt..........ok t/01-resolver..............ok t/02-header................ok t/03-question..............ok t/04-packet-unique-push....ok t/04-packet................ok t/05-rr-opt................ok t/05-rr-sshfp..............ok t/05-rr-txt................ok t/05-rr-unknown............ok t/05-rr....................ok t/06-update................ok t/07-misc..................ok t/08-online................ # Failed test 'Socket is ready' # in t/08-online.t at line 172. # Looks like you failed 1 test of 93. dubious Test returned status 1 (wstat 256, 0x100) DIED. FAILED test 74 Failed 1/93 tests, 98.92% okay (less 3 skipped tests: 89 okay, 95.70%) t/09-tkey..................ok t/10-recurse...............Server [194.134.5.5] did not give answers at /tmp/.webmin/Net-DNS-0.53/bl ib/lib/Net/DNS/Resolver/Recurse.pm line 85. Server [194.134.5.5] did not give answers at /tmp/.webmin/Net-DNS-0.53/blib/lib/Net/DNS/Resolver/Rec urse.pm line 85. # Failed test in t/10-recurse.t at line 91. # got: undef # expected: '3' # Looks like you planned 12 tests but only ran 9. # Looks like you failed 1 test of 9 run. dubious Test returned status 1 (wstat 256, 0x100) DIED. FAILED tests 9-12 Failed 4/12 tests, 66.67% okay t/11-escapedchars..........# Using the XS compiled dn_expand function # # disabling XS based dns_expand for a moment. # # Continuing to use the XS based dn_expand() ok t/11-inet6.................# # The libraries needed for IPv6 support have been found # Now we establish if we can bind to ::1 # # # Testing for global IPv6 connectivity... # preparing... # # Trying to connect to ns-pri.ripe.net (2001:610:240:0:53:0:0:3) ok 3/6 skipped: No answer available to analyse Failed 2/23 test scripts, 91.30% okay. 5/1076 subtests failed, 99.54% okay. Failed Test Stat Wstat Total Fail Failed List of Failed ------------------------------------------------------------------------------- t/08-online.t 1 256 93 1 1.08% 74 t/10-recurse.t 1 256 12 7 58.33% 9-12 13 subtests skipped. make: *** [test_dynamic] Error 255 [/code:1:8532601fb8] Ik heb geen idee hoe ik dat op kan lossen. Heb al andere nameservers opgegeven in /etc/resolv.conf, maar dit werkt niet. Wie weet er raad?
  • Staat Webmin bij jou in de "/tmp" directory? Ik denk dat daar de fout zit nl.... Groet, M.V. Wesstein
  • Nee dat is de plaats waar het pakketje uitgepakt is (via webmin). Als ik het allemaal handmatig doe, dan is dit de faillog: [code:1:f4f0c854f2] root@ares:/tmp/Net-DNS-0.53# make test PERL_DL_NONLAZY=1 /usr/bin/perl5.8.4 "-MExtUtils::Command::MM" "-e" "test_harnes s(0, 'blib/lib', 'blib/arch')" t/*.t t/00-load..................ok t/00-pod...................ok t/00-version...............ok t/01-resolver-env..........ok t/01-resolver-file.........ok 7/8 skipped: Could not read configuration file t/01-resolver-opt..........ok t/01-resolver..............ok t/02-header................ok t/03-question..............ok t/04-packet-unique-push....ok t/04-packet................ok t/05-rr-opt................ok t/05-rr-sshfp..............ok t/05-rr-txt................ok t/05-rr-unknown............ok t/05-rr....................ok t/06-update................ok t/07-misc..................ok t/08-online................ok t/09-tkey..................ok t/10-recurse...............ok 8/12Server [194.134.5.5] did not give answers at / tmp/Net-DNS-0.53/blib/lib/Net/DNS/Resolver/Recurse.pm line 85. Server [194.134.5.5] did not give answers at /tmp/Net-DNS-0.53/blib/lib/Net/DNS/ Resolver/Recurse.pm line 85. t/10-recurse...............NOK 9 # Failed test in t/10-recurse.t at line 91. # got: undef # expected: '3' # Looks like you planned 12 tests but only ran 9. # Looks like you failed 1 test of 9 run. t/10-recurse...............dubious Test returned status 1 (wstat 256, 0x100) DIED. FAILED tests 9-12 Failed 4/12 tests, 66.67% okay t/11-escapedchars..........# Using the XS compiled dn_expand function t/11-escapedchars..........ok 96/141# # disabling XS based dns_expand for a moment. t/11-escapedchars..........ok 99/141# # Continuing to use the XS based dn_expand() t/11-escapedchars..........ok t/11-inet6.................ok 1/6# # The libraries needed for IPv6 support have been found # Now we establish if we can bind to ::1 # # # Testing for global IPv6 connectivity... # preparing... t/11-inet6.................ok 3/6# # Trying to connect to ns-pri.ripe.net (2001:610:240:0:53:0:0:3) t/11-inet6.................ok 3/6 skipped: No answer available to analyse Failed Test Stat Wstat Total Fail Failed List of Failed ------------------------------------------------------------------------------- t/10-recurse.t 1 256 12 7 58.33% 9-12 10 subtests skipped. Failed 1/23 test scripts, 95.65% okay. 4/1076 subtests failed, 99.63% okay. make: *** [test_dynamic] Error 255 [/code:1:f4f0c854f2]

Beantwoord deze vraag

Weet jij het antwoord op deze vraag? Registreer of meld je aan met je account

Dit is een gearchiveerde pagina. Antwoorden is niet meer mogelijk.